Target
Sodium-dependent noradrenaline transporter
Ligand
BDBM50228435
Substrate
Meas. Tech.
ChEMBL_452612 (CHEMBL902863)
Ki
>1000±n/a nM
Citation
 Parhi, AKWang, JLOya, SChoi, SRKung, MPKung, HF 2-(2'-((dimethylamino)methyl)-4'-(fluoroalkoxy)-phenylthio)benzenamine derivatives as serotonin transporter imaging agents. J Med Chem 50:6673-84 (2007)  
Target
Name:
Sodium-dependent noradrenaline transporter
Synonyms:
Monoamine transporter NET Noradrenaline Transporter (NET) Norepinephrine transporter protein (NET) SLC6A2 Sodium-dependent noradrenaline transporter (NET) | Solute carrier family 6 member 2
Type:
Multi-pass membrane protein
Mol. Mass.:
69337.72
Organism:
Homo sapiens (Human)
Description:
P23975
Residue:
617
  
Inhibitor
Name:
BDBM50228435
Synonyms:
5-bromo-2-(2-((dimethylamino)methyl)-4-(3-fluoropropoxy)phenylthio)benzenamine | CHEMBL239302
Type:
Small organic molecule
Emp. Form.:
C18H22BrFN2OS
Mol. Mass.:
413.347
SMILES:
CN(C)Cc1cc(OCCCF)ccc1Sc1ccc(Br)cc1N
: