Target
Sodium-dependent dopamine transporter
Ligand
BDBM50228440
Substrate
Meas. Tech.
ChEMBL_452610 (CHEMBL902861)
Ki
847±n/a nM
Citation
 Parhi, AKWang, JLOya, SChoi, SRKung, MPKung, HF 2-(2'-((dimethylamino)methyl)-4'-(fluoroalkoxy)-phenylthio)benzenamine derivatives as serotonin transporter imaging agents. J Med Chem 50:6673-84 (2007)  
Target
Name:
Sodium-dependent dopamine transporter
Synonyms:
DA transporter DAT1 Dopamine transporter protein (DAT) SC6A3_HUMAN Sodium-dependent dopamine transporter Solute carrier family 6 member 3
Type:
Multi-pass membrane protein
Mol. Mass.:
68497.11
Organism:
Homo sapiens (Human)
Description:
Q01959
Residue:
620
  
Inhibitor
Name:
BDBM50228440
Synonyms:
5-chloro-2-(2-((dimethylamino)methyl)-4-(2-fluoroethoxy)phenylthio)benzenamine | CHEMBL239079
Type:
Small organic molecule
Emp. Form.:
C17H20ClFN2OS
Mol. Mass.:
354.87
SMILES:
CN(C)Cc1cc(OCCF)ccc1Sc1ccc(Cl)cc1N
: