Target
D(3) dopamine receptor
Ligand
BDBM50054067
Substrate
Meas. Tech.
ChEMBL_460309 (CHEMBL926380)
Ki
2.35±n/a nM
Citation
 Biswas, SZhang, SFernandez, FGhosh, BZhen, JKuzhikandathil, EReith, MEDutta, AK Further structure-activity relationships study of hybrid 7-{[2-(4-phenylpiperazin-1-yl)ethyl]propylamino}-5,6,7,8-tetrahydronaphthalen-2-ol analogues: identification of a high-affinity D3-preferring agonist with potent in vivo activity with long duration of action. J Med Chem 51:101-17 (2008)  
Target
Name:
D(3) dopamine receptor
Synonyms:
DOPAMINE D3 DRD3_HUMAN Dopamine D3 receptor (D3) Dopamine receptor Dopamine receptor D3
Type:
Mol. Mass.:
44243.43
Organism:
Homo sapiens (Human)
Description:
Residue:
400
  
Inhibitor
Name:
BDBM50054067
Synonyms:
(2R)-7-Dipropylamino-5,6,7,8-tetrahydro-naphthalen-2-ol (R)-7-(dipropylamino)-5,6,7,8-tetrahydronaphthalen-2-ol (R)-7-Dipropylamino-5,6,7,8-tetrahydro-naphthalen-2-ol.HCl CHEMBL301559
Type:
Small organic molecule
Emp. Form.:
C16H25NO
Mol. Mass.:
247.3758
SMILES:
CCCN(CCC)[C@@H]1CCc2ccc(O)cc2C1
: