Target
Coagulation factor X
Ligand
BDBM12676
Substrate
Meas. Tech.
ChEMBL_460575 (CHEMBL926651)
Ki
1.6±n/a nM
Citation
 Lee, YKParks, DJLu, TThieu, TVMarkotan, TPan, WMcComsey, DFMilkiewicz, KLCrysler, CSNinan, NAbad, MCGiardino, ECMaryanoff, BEDamiano, BPPlayer, MR 7-fluoroindazoles as potent and selective inhibitors of factor Xa. J Med Chem 51:282-97 (2008)  
Target
Name:
Coagulation factor X
Synonyms:
Activated coagulation factor X (FXa) Coagulation factor X precursor F10 Factor X heavy chain Factor Xa Stuart-Prower factor
Type:
Enzyme
Mol. Mass.:
54726.60
Organism:
Homo sapiens (Human)
Description:
Residue:
488
  
Inhibitor
Name:
BDBM12676
Synonyms:
1-(3-Aminobenzisoxazol-5-yl)-3-trifluoromethyl-N-[2-fluoro-4-[(2-dimethylaminomethyl)imidazol-1-yl]phenyl]-1H-pyrazole-5-carboxyamide Hydrochloride Salt BMS-561389 CHEMBL558198 Razaxaban
Type:
Small organic molecule
Emp. Form.:
C24H20F4N8O2
Mol. Mass.:
528.4616
SMILES:
CN(C)Cc1nccn1-c1ccc(NC(=O)c2cc(nn2-c2ccc3onc(N)c3c2)C(F)(F)F)c(F)c1
: