Target
Coagulation factor X
Ligand
BDBM50231283
Substrate
Meas. Tech.
ChEMBL_460575 (CHEMBL926651)
Ki
6.4±n/a nM
Citation
 Lee, YKParks, DJLu, TThieu, TVMarkotan, TPan, WMcComsey, DFMilkiewicz, KLCrysler, CSNinan, NAbad, MCGiardino, ECMaryanoff, BEDamiano, BPPlayer, MR 7-fluoroindazoles as potent and selective inhibitors of factor Xa. J Med Chem 51:282-97 (2008)  
Target
Name:
Coagulation factor X
Synonyms:
Activated coagulation factor X (FXa) Coagulation factor X precursor F10 Factor X heavy chain Factor Xa Stuart-Prower factor
Type:
Enzyme
Mol. Mass.:
54726.60
Organism:
Homo sapiens (Human)
Description:
Residue:
488
  
Inhibitor
Name:
BDBM50231283
Synonyms:
1-(3-aminobenzo[d]isoxazol-5-yl)-7-fluoro-6-[2-fluoro-4-(2-oxopiperidin-1-yl)phenyl]-1H-indazole-3-carboxamide | CHEMBL254831
Type:
Small organic molecule
Emp. Form.:
C26H20F2N6O3
Mol. Mass.:
502.4722
SMILES:
NC(=O)c1nn(-c2ccc3onc(N)c3c2)c2c(F)c(ccc12)-c1ccc(cc1F)N1CCCCC1=O
: