Target
5-hydroxytryptamine receptor 2A
Ligand
BDBM50231450
Substrate
Meas. Tech.
ChEMBL_461981 (CHEMBL945769)
Ki
1.65±n/a nM
Citation
 Graham, JMCoughenour, LLBarr, BMRock, DLNikam, SS 1-Aminoindanes as novel motif with potential atypical antipsychotic properties. Bioorg Med Chem Lett 18:489-93 (2008)  
Target
Name:
5-hydroxytryptamine receptor 2A
Synonyms:
5-HT-2 5-HT2A 5-hydroxytryptamine receptor 2A (5HT-2A) 5HT2A_HUMAN HTR2A | Serotonin receptor 2A
Type:
undefined
Mol. Mass.:
52607.65
Organism:
Homo sapiens (Human)
Description:
P28223
Residue:
471
  
Inhibitor
Name:
BDBM50231450
Synonyms:
CHEMBL252429 | N-(5-(2-(4-(benzo[d]isothiazol-3-yl)piperazin-1-yl)ethyl)-2,3-dihydro-1H-inden-1-yl)-4-fluorobenzamide
Type:
Small organic molecule
Emp. Form.:
C29H29FN4OS
Mol. Mass.:
500.63
SMILES:
Fc1ccc(cc1)C(=O)NC1CCc2cc(CCN3CCN(CC3)c3nsc4ccccc34)ccc12
: