Target
Alpha-1A adrenergic receptor
Ligand
BDBM50231451
Substrate
Meas. Tech.
ChEMBL_461983 (CHEMBL944826)
Ki
3.96±n/a nM
Citation
 Graham, JMCoughenour, LLBarr, BMRock, DLNikam, SS 1-Aminoindanes as novel motif with potential atypical antipsychotic properties. Bioorg Med Chem Lett 18:489-93 (2008)  
Target
Name:
Alpha-1A adrenergic receptor
Synonyms:
ADA1A_RAT Adra1c Alpha-1A adrenoceptor Alpha-1C adrenergic receptor | adrenergic Alpha1A
Type:
Protein
Mol. Mass.:
51620.15
Organism:
Rattus norvegicus (Rat)
Description:
P43140
Residue:
466
  
Inhibitor
Name:
BDBM50231451
Synonyms:
CHEMBL400235 | N-(6-(2-(4-(benzo[d]isothiazol-3-yl)piperazin-1-yl)ethyl)-2,3-dihydro-1H-inden-1-yl)butyramide
Type:
Small organic molecule
Emp. Form.:
C26H32N4OS
Mol. Mass.:
448.623
SMILES:
CCCC(=O)NC1CCc2ccc(CCN3CCN(CC3)c3nsc4ccccc34)cc12
: