Target
High affinity nerve growth factor receptor
Ligand
BDBM27917
Substrate
Meas. Tech.
ChEMBL_462427 (CHEMBL927243)
IC50
11±n/a nM
Citation
 Illig, CRChen, JWall, MJWilson, KJBallentine, SKRudolph, MJDesJarlais, RLChen, YSchubert, CPetrounia, ICrysler, CSMolloy, CJChaikin, MAManthey, CLPlayer, MRTomczuk, BEMeegalla, SK Discovery of novel FMS kinase inhibitors as anti-inflammatory agents. Bioorg Med Chem Lett 18:1642-8 (2008)  
Target
Name:
High affinity nerve growth factor receptor
Synonyms:
2.7.10.1 NTRK1 NTRK1_HUMAN Neurotrophic tyrosine kinase receptor type 1 Synonyms=MTC TRK1-transforming tyrosine kinase protein TRKA GN Tropomyosin alpha-3 chain/High affinity nerve growth factor receptor Tropomyosin-related kinase A (TrkA) Tyrosine kinase receptor (Trk) Tyrosine kinase receptor A (Trk A) Tyrosine kinase receptor A (TrkA) p140-TrkA
Type:
Mol. Mass.:
87498.18
Organism:
Homo sapiens (Human)
Description:
P04629
Residue:
796
  
Inhibitor
Name:
BDBM27917
Synonyms:
4-cyano-N-[4-(4-methylpiperazin-1-yl)-2-(4-methylpiperidin-1-yl)phenyl]-1H-pyrrole-2-carboxamide arylamide, 8
Type:
Small organic molecule
Emp. Form.:
C23H30N6O
Mol. Mass.:
406.5239
SMILES:
CC1CCN(CC1)c1cc(ccc1NC(=O)c1cc(c[nH]1)C#N)N1CCN(C)CC1
: