Target
Carboxypeptidase A1
Ligand
BDBM50411604
Substrate
Meas. Tech.
ChEMBL_462453 (CHEMBL928318)
Ki
11000±n/a nM
Citation
 Deaton, DNGraham, KPGross, JWMiller, AB Thiol-based angiotensin-converting enzyme 2 inhibitors: P1' modifications for the exploration of the S1' subsite. Bioorg Med Chem Lett 18:1681-7 (2008)  
Target
Name:
Carboxypeptidase A1
Synonyms:
CBPA1_HUMAN CPA1
Type:
PROTEIN
Mol. Mass.:
47132.61
Organism:
Homo sapiens (Human)
Description:
ChEMBL_1496378
Residue:
419
  
Inhibitor
Name:
BDBM50411604
Synonyms:
CHEMBL252009
Type:
Small organic molecule
Emp. Form.:
C24H25F6NO4S
Mol. Mass.:
537.515
SMILES:
CC[C@@H](C)[C@H](S)C(=O)N[C@@H](Cc1ccc(OCc2cc(cc(c2)C(F)(F)F)C(F)(F)F)cc1)C(O)=O
: