Target
Carboxypeptidase A1
Ligand
BDBM50411616
Substrate
Meas. Tech.
ChEMBL_462453 (CHEMBL928318)
Ki
14000±n/a nM
Citation
 Deaton, DNGraham, KPGross, JWMiller, AB Thiol-based angiotensin-converting enzyme 2 inhibitors: P1' modifications for the exploration of the S1' subsite. Bioorg Med Chem Lett 18:1681-7 (2008)  
Target
Name:
Carboxypeptidase A1
Synonyms:
CBPA1_HUMAN CPA1
Type:
PROTEIN
Mol. Mass.:
47132.61
Organism:
Homo sapiens (Human)
Description:
ChEMBL_1496378
Residue:
419
  
Inhibitor
Name:
BDBM50411616
Synonyms:
CHEMBL252003
Type:
Small organic molecule
Emp. Form.:
C21H25NO4S
Mol. Mass.:
387.493
SMILES:
CC[C@@H](C)[C@H](S)C(=O)N[C@@H](Cc1cccc(Oc2ccccc2)c1)C(O)=O
: