Target
Receptor tyrosine-protein kinase erbB-2
Ligand
BDBM50236383
Substrate
Meas. Tech.
ChEMBL_462988 (CHEMBL928909)
IC50
32±n/a nM
Citation
 Barlaam, BActon, DGBallard, PBradbury, RHCross, DDucray, RGermain, HHudson, KKlinowska, TMagnien, FOgilvie, DJOlivier, ARoss, HSSmith, RTrigwell, CBVautier, MWright, L Neutral 5-substituted 4-indazolylaminoquinazolines as potent, orally active inhibitors of erbB2 receptor tyrosine kinase. Bioorg Med Chem Lett 18:1799-803 (2008)  
Target
Name:
Receptor tyrosine-protein kinase erbB-2
Synonyms:
2.7.10.1 CD_antigen=CD340 ERBB2_HUMAN FASN/HER2 HER2 MLN19 NEU Proto-oncogene Neu Tyrosine kinase-type cell surface receptor HER2 | p185erbB2
Type:
Mol. Mass.:
137894.47
Organism:
Homo sapiens (Human)
Description:
P04626
Residue:
1255
  
Inhibitor
Name:
BDBM50236383
Synonyms:
(R)-2-(4-(1-(pyridin-2-ylmethyl)-1H-indazol-5-ylamino)quinazolin-5-yloxy)propanamide | CHEMBL256363
Type:
Small organic molecule
Emp. Form.:
C24H21N7O2
Mol. Mass.:
439.4692
SMILES:
C[C@@H](Oc1cccc2ncnc(Nc3ccc4n(Cc5ccccn5)ncc4c3)c12)C(N)=O
: