Target
Adenosine receptor A1
Ligand
BDBM50237067
Substrate
Meas. Tech.
ChEMBL_463077 (CHEMBL928987)
Ki
100±n/a nM
Citation
 Zhang, XRueter, JKChen, YMoorjani, MLanier, MCLin, EGross, RSTellew, JEWilliams, JPLechner, SMMarkison, SJoswig, TMalany, SSantos, MCastro-Palomino, JCCrespo, MIPrat, MGual, SDíaz, JLSaunders, JSlee, DH Synthesis of N-pyrimidinyl-2-phenoxyacetamides as adenosine A2A receptor antagonists. Bioorg Med Chem Lett 18:1778-83 (2008)  
Target
Name:
Adenosine receptor A1
Synonyms:
A1 adenosine receptor (hA1) AA1R_HUMAN ADORA1 Adenosine A1-receptor Adenosine receptor A1 (hA1) | Adenosine transporter (AdT)
Type:
G Protein-Coupled Receptor (GPCR)
Mol. Mass.:
36520.92
Organism:
Homo sapiens (Human)
Description:
P30542
Residue:
326
  
Inhibitor
Name:
BDBM50237067
Synonyms:
CHEMBL429125 | N-(6-(3,5-dimethyl-1H-pyrazol-1-yl)-2-(5-methylfuran-2-yl)pyrimidin-4-yl)-2-(4-((dimethylamino)methyl)-2-methoxyphenoxy)acetamide
Type:
Small organic molecule
Emp. Form.:
C26H30N6O4
Mol. Mass.:
490.5542
SMILES:
COc1cc(CN(C)C)ccc1OCC(=O)Nc1cc(nc(n1)-c1ccc(C)o1)-n1nc(C)cc1C
: