Target
Adenosine receptor A2a
Ligand
BDBM50237074
Substrate
Meas. Tech.
ChEMBL_463076 (CHEMBL928986)
Ki
1.2±n/a nM
Citation
 Zhang, XRueter, JKChen, YMoorjani, MLanier, MCLin, EGross, RSTellew, JEWilliams, JPLechner, SMMarkison, SJoswig, TMalany, SSantos, MCastro-Palomino, JCCrespo, MIPrat, MGual, SDíaz, JLSaunders, JSlee, DH Synthesis of N-pyrimidinyl-2-phenoxyacetamides as adenosine A2A receptor antagonists. Bioorg Med Chem Lett 18:1778-83 (2008)  
Target
Name:
Adenosine receptor A2a
Synonyms:
A2A adenosine receptor (hA2A) ADENOSINE A2 ADORA2 Adenosine A2A receptor (A2AAR)
Type:
G Protein-Coupled Receptor (GPCR)
Mol. Mass.:
44716.46
Organism:
Homo sapiens (Human)
Description:
P29274
Residue:
412
  
Inhibitor
Name:
BDBM50237074
Synonyms:
CHEMBL256755 | N-(6-(3,5-dimethyl-1H-pyrazol-1-yl)-2-(5-methylfuran-2-yl)pyrimidin-4-yl)-2-(2-(2-morpholinoethyl)phenoxy)acetamide
Type:
Small organic molecule
Emp. Form.:
C28H32N6O4
Mol. Mass.:
516.5915
SMILES:
Cc1cc(C)n(n1)-c1cc(NC(=O)COc2ccccc2CCN2CCOCC2)nc(n1)-c1ccc(C)o1
: