Target
Prostaglandin G/H synthase 2
Ligand
BDBM50240347
Substrate
Meas. Tech.
ChEMBL_508956 (CHEMBL1005508)
IC50
12000±n/a nM
Citation
 Ringbom, THuss, UStenholm, AFlock, SSkattebøl, LPerera, PBohlin, L Cox-2 inhibitory effects of naturally occurring and modified fatty acids. J Nat Prod 64:745-9 (2001)  
Target
Name:
Prostaglandin G/H synthase 2
Synonyms:
COX2 Cyclooxygenase-2 (COX-2) PTGS2 Prostaglandin G/H synthase (cyclooxygenase)
Type:
Protein
Mol. Mass.:
68976.98
Organism:
Ovis aries (Sheep)
Description:
Residue:
603
  
Inhibitor
Name:
BDBM50240347
Synonyms:
(9,12,15)-linolenic acid (Z,Z,Z)-9,12,15-octadecatrienoic acid ALA all-cis-9,12,15-octadecatrienoic acid cid_5280934 cis-Delta(9,12,15)-octadecatrienoic acid | linolenic acid
Type:
Small organic molecule
Emp. Form.:
C18H30O2
Mol. Mass.:
278.4296
SMILES:
CC\C=C/C\C=C/C\C=C/CCCCCCCC(O)=O
: