Target
Alpha-glucosidase MAL62
Ligand
BDBM50242270
Substrate
Meas. Tech.
ChEMBL_486596 (CHEMBL1021775)
IC50
260000±n/a nM
Citation
 Yasuda, KKizu, HYamashita, TKameda, YKato, ANash, RJFleet, GWMolyneux, RJAsano, N New sugar-mimic alkaloids from the pods of Angylocalyx pynaertii. J Nat Prod 65:198-202 (2002)  
Target
Name:
Alpha-glucosidase MAL62
Synonyms:
MAL62 MAL6S
Type:
PROTEIN
Mol. Mass.:
68174.43
Organism:
Saccharomyces cerevisiae
Description:
ChEMBL_942538
Residue:
584
  
Inhibitor
Name:
BDBM50242270
Synonyms:
(2R,3R,4R,5R)-1-ethoxy-2,5-bis(hydroxymethyl)pyrrolidine-3,4-diol | CHEMBL471888
Type:
Small organic molecule
Emp. Form.:
C8H17NO5
Mol. Mass.:
207.2243
SMILES:
OCCN1[C@H](CO)[C@@H](O)[C@H](O)[C@H]1CO
: