Target
Beta-galactosidase
Ligand
BDBM50242267
Substrate
Meas. Tech.
ChEMBL_486587 (CHEMBL1021766)
IC50
30000±n/a nM
Citation
 Yasuda, KKizu, HYamashita, TKameda, YKato, ANash, RJFleet, GWMolyneux, RJAsano, N New sugar-mimic alkaloids from the pods of Angylocalyx pynaertii. J Nat Prod 65:198-202 (2002)  
Target
Name:
Beta-galactosidase
Synonyms:
β-galactosidase Beta-galactosidase/Glucosylceramidase | GLB1
Type:
Protein
Mol. Mass.:
73420.88
Organism:
Bos taurus (Bovine)
Description:
Residue:
653
  
Inhibitor
Name:
BDBM50242267
Synonyms:
2,5-imino-1,2,5-trideoxy-D-mannitol | CHEMBL443158
Type:
Small organic molecule
Emp. Form.:
C6H13NO3
Mol. Mass.:
147.1723
SMILES:
C[C@H]1N[C@H](CO)[C@@H](O)[C@@H]1O
: