Target
Tissue alpha-L-fucosidase
Ligand
BDBM50242269
Substrate
Meas. Tech.
ChEMBL_486589 (CHEMBL1021768)
IC50
35000±n/a nM
Citation
 Yasuda, KKizu, HYamashita, TKameda, YKato, ANash, RJFleet, GWMolyneux, RJAsano, N New sugar-mimic alkaloids from the pods of Angylocalyx pynaertii. J Nat Prod 65:198-202 (2002)  
Target
Name:
Tissue alpha-L-fucosidase
Synonyms:
Alpha-L-fucosidase 1 FUCO_BOVIN
Type:
PROTEIN
Mol. Mass.:
54093.12
Organism:
Bos taurus
Description:
ChEMBL_335897
Residue:
468
  
Inhibitor
Name:
BDBM50242269
Synonyms:
2,5-dideoxy-2,5-imino-D-fucitol | CHEMBL458368
Type:
Small organic molecule
Emp. Form.:
C6H13NO3
Mol. Mass.:
147.1723
SMILES:
C[C@H]1N[C@@H](CO)[C@@H](O)[C@H]1O
: