Target
Tissue alpha-L-fucosidase
Ligand
BDBM50065257
Substrate
Meas. Tech.
ChEMBL_486589 (CHEMBL1021768)
Ki
5.3±n/a nM
Citation
 Yasuda, KKizu, HYamashita, TKameda, YKato, ANash, RJFleet, GWMolyneux, RJAsano, N New sugar-mimic alkaloids from the pods of Angylocalyx pynaertii. J Nat Prod 65:198-202 (2002)  
Target
Name:
Tissue alpha-L-fucosidase
Synonyms:
Alpha-L-fucosidase 1 FUCO_BOVIN
Type:
PROTEIN
Mol. Mass.:
54093.12
Organism:
Bos taurus
Description:
ChEMBL_335897
Residue:
468
  
Inhibitor
Name:
BDBM50065257
Synonyms:
(2R,3R,4R,5R,6S)-2-Hydroxymethyl-6-methyl-piperidine-3,4,5-triol beta-homofuconojirimycin
Type:
Small organic molecule
Emp. Form.:
C7H15NO4
Mol. Mass.:
177.1983
SMILES:
C[C@@H]1N[C@H](CO)[C@@H](O)[C@H](O)[C@@H]1O
: