Target
Polyphenol oxidase 2
Ligand
BDBM50219502
Substrate
Meas. Tech.
ChEMBL_484471 (CHEMBL1010474)
IC50
24000000±n/a nM
Citation
 Li, CYWu, TS Constituents of the stigmas of Crocus sativus and their tyrosinase inhibitory activity. J Nat Prod 65:1452-6 (2002)  
Target
Name:
Polyphenol oxidase 2
Synonyms:
Monophenol monooxygenase PPO2 Tyrosinase
Type:
Protein
Mol. Mass.:
63923.66
Organism:
Agaricus bisporus (Common mushroom)
Description:
O42713
Residue:
556
  
Inhibitor
Name:
BDBM50219502
Synonyms:
4-hydroxyphenyl beta-D-glucopyranoside CHEMBL232202 p-hydroxyphenyl beta-D-glucopyranoside | p-hydroxyphenyl beta-D-glucoside
Type:
Small organic molecule
Emp. Form.:
C12H16O7
Mol. Mass.:
272.2512
SMILES:
OC[C@H]1O[C@@H](Oc2ccc(O)cc2)[C@H](O)[C@@H](O)[C@@H]1O
: