Target
DNA topoisomerase 1
Ligand
BDBM50150484
Substrate
Meas. Tech.
ChEMBL_509474 (CHEMBL1008110)
IC50
31000±n/a nM
Citation
 Carballeira, NMBetancourt, JEOrellano, EAGonzález, FA Total synthesis and biological evaluation of (5Z,9Z)-5,9-hexadecadienoic acid, an inhibitor of human topoisomerase I. J Nat Prod 65:1715-8 (2002)  
Target
Name:
DNA topoisomerase 1
Synonyms:
DNA topoisomerase I TOP1 | TOP1_HUMAN
Type:
Enzyme
Mol. Mass.:
90771.02
Organism:
Homo sapiens (Human)
Description:
P11387
Residue:
765
  
Inhibitor
Name:
BDBM50150484
Synonyms:
(Z)-9-octadecenoic acid CHEMBL8659 Octadec-9-enoic acid oleicacid
Type:
Small organic molecule
Emp. Form.:
C18H34O2
Mol. Mass.:
282.4614
SMILES:
CCCCCCCC\C=C/CCCCCCCC(O)=O
: