Target
Estrogen receptor
Ligand
BDBM19459
Substrate
Meas. Tech.
ChEMBL_504921 (CHEMBL946607)
IC50
300±n/a nM
Citation
 Calderón, AITerreaux, CSchenk, KPattison, PBurdette, JEPezzuto, JMGupta, MPHostettmann, K Isolation and structure elucidation of an isoflavone and a sesterterpenoic acid from Henriettella fascicularis. J Nat Prod 65:1749-53 (2002)  
Target
Name:
Estrogen receptor
Synonyms:
ER ESR ESR1_HUMAN Estrogen receptor Estrogen receptor (ER-alpha) Estrogen receptor alpha (ER) Nuclear receptor subfamily 3 group A member 1
Type:
Protein
Mol. Mass.:
66230.44
Organism:
Homo sapiens (Human)
Description:
P03372
Residue:
595
  
Inhibitor
Name:
BDBM19459
Synonyms:
5,7-dihydroxy-3-(4-hydroxyphenyl)-4H-chromen-4-one Genistein Genisteol US8552057, 2 | cid_5280961
Type:
Phytoestrogen
Emp. Form.:
C15H10O5
Mol. Mass.:
270.2369
SMILES:
Oc1ccc(cc1)-c1coc2cc(O)cc(O)c2c1=O
: