Target
Tissue alpha-L-fucosidase
Ligand
BDBM50278882
Substrate
Meas. Tech.
ChEMBL_545878 (CHEMBL1034393)
IC50
13000±n/a nM
Citation
 Yamashita, TYasuda, KKizu, HKameda, YWatson, AANash, RJFleet, GWAsano, N New polyhydroxylated pyrrolidine, piperidine, and pyrrolizidine alkaloids from Scilla sibirica. J Nat Prod 65:1875-81 (2002)  
Target
Name:
Tissue alpha-L-fucosidase
Synonyms:
Alpha-L-fucosidase 1 FUCO_BOVIN
Type:
PROTEIN
Mol. Mass.:
54093.12
Organism:
Bos taurus
Description:
ChEMBL_335897
Residue:
468
  
Inhibitor
Name:
BDBM50278882
Synonyms:
(2S,3S,4S,5S,6R)-2-((2R,3S,4S,5R,6R)-3,5-dihydroxy-2-((2R,3R,4R,5R)-4-hydroxy-2-(2-hydroxyethyl)-5-(hydroxymethyl)pyrrolidin-3-yloxy)-6-(hydroxymethyl)tetrahydro-2H-pyran-4-yloxy)-6-(hydroxymethyl)tetrahydro-2H-pyran-3,4,5-triol | CHEMBL522570
Type:
Small organic molecule
Emp. Form.:
C19H35NO14
Mol. Mass.:
501.4795
SMILES:
OCC[C@H]1N[C@H](CO)[C@@H](O)[C@@H]1O[C@@H]1O[C@H](CO)[C@@H](O)[C@H](O[C@@H]2O[C@H](CO)[C@@H](O)[C@H](O)[C@@H]2O)[C@@H]1O
: