Target
Muscarinic acetylcholine receptor M3
Ligand
BDBM50241916
Substrate
Meas. Tech.
ChEMBL_550722 (CHEMBL1006036)
Ki
970±n/a nM
Citation
 Ikeda, YNonaka, HFurumai, TOnaka, HIgarashi, Y Nocardimicins A, B, C, D, E, and F, siderophores with muscarinic M3 receptor inhibiting activity from Nocardia sp. TP-A0674. J Nat Prod 68:1061-5 (2005)  
Target
Name:
Muscarinic acetylcholine receptor M3
Synonyms:
ACM3_HUMAN Cholinergic, muscarinic M3 Muscarinic receptor M3 | RecName: Full=Muscarinic acetylcholine receptor M3
Type:
Enzyme
Mol. Mass.:
66151.03
Organism:
Homo sapiens (Human)
Description:
P20309
Residue:
590
  
Inhibitor
Name:
BDBM50241916
Synonyms:
CHEMBL510340 | Noccardimicin E
Type:
Small organic molecule
Emp. Form.:
C41H63N5O9
Mol. Mass.:
769.967
SMILES:
CCCCCCCCCCCCCC(OC(=O)C(CCCCN(O)C(C)=O)NC(=O)c1coc(n1)-c1ccccc1O)C(C)C(=O)NC1CCCCNC1=O
: