Target
Muscarinic acetylcholine receptor M2
Ligand
BDBM50241913
Substrate
Meas. Tech.
ChEMBL_550724 (CHEMBL1006038)
IC50
1780±n/a nM
Citation
 Ikeda, YNonaka, HFurumai, TOnaka, HIgarashi, Y Nocardimicins A, B, C, D, E, and F, siderophores with muscarinic M3 receptor inhibiting activity from Nocardia sp. TP-A0674. J Nat Prod 68:1061-5 (2005)  
Target
Name:
Muscarinic acetylcholine receptor M2
Synonyms:
ACM2_HUMAN Cholinergic, muscarinic M2 Muscarinic acetylcholine receptor M2 and M5 | RecName: Full=Muscarinic acetylcholine receptor M2
Type:
GPCR
Mol. Mass.:
51730.61
Organism:
Homo sapiens (Human)
Description:
P08172
Residue:
466
  
Inhibitor
Name:
BDBM50241913
Synonyms:
CHEMBL499519 nocardimicin B
Type:
Small organic molecule
Emp. Form.:
C39H59N5O10
Mol. Mass.:
757.9133
SMILES:
CCCCCCCCCCCC(OC(=O)C(CCCCN(O)C(C)=O)NC(=O)c1coc(n1)-c1ccccc1O)C(C)C(=O)NC1CCCCN(O)C1=O
: