Target
Sodium-dependent noradrenaline transporter
Ligand
BDBM50241785
Substrate
Meas. Tech.
ChEMBL_526495 (CHEMBL975646)
IC50
6040±n/a nM
Citation
 Cheng, MCLi, CYKo, HCKo, FNLin, YLWu, TS Antidepressant principles of the roots of Polygala tenuifolia. J Nat Prod 69:1305-9 (2006)  
Target
Name:
Sodium-dependent noradrenaline transporter
Synonyms:
Monoamine transporter NET Noradrenaline Transporter (NET) Norepinephrine transporter protein (NET) SLC6A2 Sodium-dependent noradrenaline transporter (NET) | Solute carrier family 6 member 2
Type:
Multi-pass membrane protein
Mol. Mass.:
69337.72
Organism:
Homo sapiens (Human)
Description:
P23975
Residue:
617
  
Inhibitor
Name:
BDBM50241785
Synonyms:
3-O-benzoylpolygolitosyl-(2->1)-alpha-galactose | CHEMBL462805
Type:
Small organic molecule
Emp. Form.:
C19H28O10
Mol. Mass.:
416.4196
SMILES:
OC[C@@H]1OC[C@@H](O[C@@H]2O[C@@H](CO)[C@@H](O)[C@@H](OCc3ccccc3)[C@@H]2O)[C@H](O)[C@H]1O
: