Target
Botulinum neurotoxin type A
Ligand
BDBM50242339
Substrate
Meas. Tech.
ChEMBL_508387 (CHEMBL1008251)
Ki
700±n/a nM
Citation
 Burnett, JCRuthel, GStegmann, CMPanchal, RGNguyen, TLHermone, ARStafford, RGLane, DJKenny, TAMcGrath, CFWipf, PStahl, AMSchmidt, JJGussio, RBrunger, ATBavari, S Inhibition of metalloprotease botulinum serotype A from a pseudo-peptide binding mode to a small molecule that is active in primary neurons. J Biol Chem 282:5004-14 (2007)  
Target
Name:
Botulinum neurotoxin type A
Synonyms:
BXA1_CLOBH bna | botA
Type:
PROTEIN
Mol. Mass.:
149421.96
Organism:
Clostridium botulinum (strain Hall / ATCC 3502 / NCTC 13319 / Type A)
Description:
ChEMBL_987932
Residue:
1296
  
Inhibitor
Name:
BDBM50242339
Synonyms:
(S)-2-{(S)-2-[(S)-6-Amino-2-((2S,3R)-2-{(S)-2-[(S)-5-guanidino-2-((S)-2-mercapto-3-phenyl-propionylamino)-pentanoylamino]-propionylamino}-3-hydroxy-butyrylamino)-hexanoylamino]-propionylamino}-4-methyl-pentanoic acid | CHEMBL503713
Type:
Small organic molecule
Emp. Form.:
C37H62N10O9S
Mol. Mass.:
823.015
SMILES:
[#6]-[#6](-[#6])-[#6]-[#6@H](-[#7]-[#6](=O)-[#6@H](-[#6])-[#7]-[#6](=O)-[#6@H](-[#6]-[#6]-[#6]-[#6]-[#7])-[#7]-[#6](=O)-[#6@@H](-[#7]-[#6](=O)-[#6@H](-[#6])-[#7]-[#6](=O)-[#6@H](-[#6]-[#6]-[#6]\[#7]=[#6](/[#7])-[#7])-[#7]-[#6](=O)-[#6@@H](-[#16])-[#6]-c1ccccc1)-[#6@@H](-[#6])-[#8])-[#6](-[#8])=O
: