Target
Casein kinase I isoform delta
Ligand
BDBM50260228
Substrate
Meas. Tech.
ChEMBL_508722 (CHEMBL1004016)
IC50
1400±n/a nM
Citation
 Quintavalle, MSambucini, SSumma, VOrsatti, LTalamo, FDe Francesco, RNeddermann, P Hepatitis C virus NS5A is a direct substrate of casein kinase I-alpha, a cellular kinase identified by inhibitor affinity chromatography using specific NS5A hyperphosphorylation inhibitors. J Biol Chem 282:5536-44 (2007)  
Target
Name:
Casein kinase I isoform delta
Synonyms:
CKI-delta CSNK1D Casein kinase I delta Casein kinase I isoform delta (CK1D) KC1D_HUMAN | casein kinases 1 delta (CK1 delta)
Type:
Enzyme
Mol. Mass.:
47356.76
Organism:
Homo sapiens (Human)
Description:
P48730
Residue:
415
  
Inhibitor
Name:
BDBM50260228
Synonyms:
CHEMBL489344 | N-methyl-4-(2-(piperidin-4-yl)-5-(3-(trifluoromethyl)phenyl)-1H-imidazol-4-yl)pyrimidin-2-amine
Type:
Small organic molecule
Emp. Form.:
C20H21F3N6
Mol. Mass.:
402.4161
SMILES:
CNc1nccc(n1)-c1nc([nH]c1-c1cccc(c1)C(F)(F)F)C1CCNCC1
: