Target
Mitogen-activated protein kinase 8
Ligand
BDBM50260228
Substrate
Meas. Tech.
ChEMBL_508725 (CHEMBL1004019)
IC50
385000±n/a nM
Citation
 Quintavalle, MSambucini, SSumma, VOrsatti, LTalamo, FDe Francesco, RNeddermann, P Hepatitis C virus NS5A is a direct substrate of casein kinase I-alpha, a cellular kinase identified by inhibitor affinity chromatography using specific NS5A hyperphosphorylation inhibitors. J Biol Chem 282:5536-44 (2007)  
Target
Name:
Mitogen-activated protein kinase 8
Synonyms:
JNK-46 JNK1-alpha-1 MK08_HUMAN PRKM8 SAPK1C c-Jun N-terminal kinase 1 c-Jun N-terminal kinase 1(JNK1) | c-Jun N-terminal kinase 2 (JNK2)
Type:
Enzyme
Mol. Mass.:
48297.57
Organism:
Homo sapiens (Human)
Description:
JNK-1 was purchased from Upstate Cell Signaling Solutions (formerly Upstate Biotechnology).
Residue:
427
  
Inhibitor
Name:
BDBM50260228
Synonyms:
CHEMBL489344 | N-methyl-4-(2-(piperidin-4-yl)-5-(3-(trifluoromethyl)phenyl)-1H-imidazol-4-yl)pyrimidin-2-amine
Type:
Small organic molecule
Emp. Form.:
C20H21F3N6
Mol. Mass.:
402.4161
SMILES:
CNc1nccc(n1)-c1nc([nH]c1-c1cccc(c1)C(F)(F)F)C1CCNCC1
: