Target
Casein kinase I isoform delta
Ligand
BDBM50260229
Substrate
Meas. Tech.
ChEMBL_508722 (CHEMBL1004016)
IC50
400±n/a nM
Citation
 Quintavalle, MSambucini, SSumma, VOrsatti, LTalamo, FDe Francesco, RNeddermann, P Hepatitis C virus NS5A is a direct substrate of casein kinase I-alpha, a cellular kinase identified by inhibitor affinity chromatography using specific NS5A hyperphosphorylation inhibitors. J Biol Chem 282:5536-44 (2007)  
Target
Name:
Casein kinase I isoform delta
Synonyms:
CKI-delta CSNK1D Casein kinase I delta Casein kinase I isoform delta (CK1D) KC1D_HUMAN | casein kinases 1 delta (CK1 delta)
Type:
Enzyme
Mol. Mass.:
47356.76
Organism:
Homo sapiens (Human)
Description:
P48730
Residue:
415
  
Inhibitor
Name:
BDBM50260229
Synonyms:
4-(4-(4-fluorophenyl)-2-(4-methylcyclohexyl)-1H-imidazol-5-yl)pyridine | CHEMBL523938
Type:
Small organic molecule
Emp. Form.:
C21H22FN3
Mol. Mass.:
335.4179
SMILES:
CC1CCC(CC1)c1nc(c([nH]1)-c1ccc(F)cc1)-c1ccncc1
: