Target
Ribosomal protein S6 kinase alpha-3
Ligand
BDBM50260229
Substrate
Meas. Tech.
ChEMBL_508720 (CHEMBL1004014)
IC50
39000±n/a nM
Citation
 Quintavalle, MSambucini, SSumma, VOrsatti, LTalamo, FDe Francesco, RNeddermann, P Hepatitis C virus NS5A is a direct substrate of casein kinase I-alpha, a cellular kinase identified by inhibitor affinity chromatography using specific NS5A hyperphosphorylation inhibitors. J Biol Chem 282:5536-44 (2007)  
Target
Name:
Ribosomal protein S6 kinase alpha-3
Synonyms:
90 kDa ribosomal protein S6 kinase 3 ISPK1 MAP kinase-activated protein kinase 1b RPS6KA3 RSK2 Ribosomal protein S6 kinase Ribosomal protein S6 kinase alpha-3 (RSK2) S6K-alpha 3 p90 ribosomal s6 kinase (RSK2) p90RSK | pp90RSK2
Type:
Serine/threonine-protein kinase
Mol. Mass.:
83740.03
Organism:
Homo sapiens (Human)
Description:
The human RSK2 sequence differed from the Genbank entry NM_004586 at one residue, V45G. The protein was cloned and purified from baculovirus expression system.
Residue:
740
  
Inhibitor
Name:
BDBM50260229
Synonyms:
4-(4-(4-fluorophenyl)-2-(4-methylcyclohexyl)-1H-imidazol-5-yl)pyridine | CHEMBL523938
Type:
Small organic molecule
Emp. Form.:
C21H22FN3
Mol. Mass.:
335.4179
SMILES:
CC1CCC(CC1)c1nc(c([nH]1)-c1ccc(F)cc1)-c1ccncc1
: