Target
Casein kinase II subunit alpha
Ligand
BDBM50260229
Substrate
Meas. Tech.
ChEMBL_508727 (CHEMBL1004021)
IC50
>100000±n/a nM
Citation
 Quintavalle, MSambucini, SSumma, VOrsatti, LTalamo, FDe Francesco, RNeddermann, P Hepatitis C virus NS5A is a direct substrate of casein kinase I-alpha, a cellular kinase identified by inhibitor affinity chromatography using specific NS5A hyperphosphorylation inhibitors. J Biol Chem 282:5536-44 (2007)  
Target
Name:
Casein kinase II subunit alpha
Synonyms:
CK II CK2- alpha CSK21_HUMAN Casein kinase 2 Casein kinase II alpha/beta Casein kinase II subunit alpha (CK2A1) Casein kinase II subunit alpha (CK2a V66A) Casein kinase II subunit alpha (CK2a)
Type:
Enzyme
Mol. Mass.:
45151.12
Organism:
Homo sapiens (Human)
Description:
P68400
Residue:
391
  
Inhibitor
Name:
BDBM50260229
Synonyms:
4-(4-(4-fluorophenyl)-2-(4-methylcyclohexyl)-1H-imidazol-5-yl)pyridine | CHEMBL523938
Type:
Small organic molecule
Emp. Form.:
C21H22FN3
Mol. Mass.:
335.4179
SMILES:
CC1CCC(CC1)c1nc(c([nH]1)-c1ccc(F)cc1)-c1ccncc1
: