Target
Collagenase 3
Ligand
BDBM50265079
Substrate
Meas. Tech.
ChEMBL_507870 (CHEMBL952567)
IC50
0.670000±n/a nM
Citation
 Johnson, ARPavlovsky, AGOrtwine, DFPrior, FMan, CFBornemeier, DABanotai, CAMueller, WTMcConnell, PYan, CBaragi, VLesch, CRoark, WHWilson, MDatta, KGuzman, RHan, HKDyer, RD Discovery and characterization of a novel inhibitor of matrix metalloprotease-13 that reduces cartilage damage in vivo without joint fibroplasia side effects. J Biol Chem 282:27781-91 (2007)  
Target
Name:
Collagenase 3
Synonyms:
MMP-13 MMP13_HUMAN Matrix metalloproteinase-13 (MMP-13) | Matrix metalloproteinase-13 (MMP13)
Type:
Enzyme
Mol. Mass.:
53808.06
Organism:
Homo sapiens (Human)
Description:
P45452
Residue:
471
  
Inhibitor
Name:
BDBM50265079
Synonyms:
(4-[1-methyl-2,4-dioxo-6-(3-phenyl-prop-1-ynyl)-1,4-dihydro-2H-quinazolin-3-ylmethyl]-benzoic acid) 4-{[1-METHYL-2,4-DIOXO-6-(3-PHENYLPROP-1-YN-1-YL)-1,4-DIHYDROQUINAZOLIN-3(2H)-YL]METHYL}BENZOIC ACID MMP Inhibitor, 5
Type:
Small organic molecule
Emp. Form.:
C26H20N2O4
Mol. Mass.:
424.448
SMILES:
Cn1c2ccc(cc2c(=O)n(Cc2ccc(cc2)C(O)=O)c1=O)C#CCc1ccccc1
: