Target
Plasminogen activator inhibitor 1
Ligand
BDBM50242805
Substrate
Meas. Tech.
ChEMBL_532146 (CHEMBL970333)
IC50
8500±n/a nM
Citation
 Jain, MRShetty, SChakrabarti, GPandya, VSharma, AParmar, BSrivastava, SRaviya, MSoni, HPatel, PR In vitro PAI-1 inhibitory activity of oxalamide derivatives. Eur J Med Chem 43:880-4 (2008)  
Target
Name:
Plasminogen activator inhibitor 1
Synonyms:
Endothelial plasminogen activator inhibitor PAI-1 PAI1_HUMAN Plasminogen activator inhibitor 1 Plasminogen activator inhibitor-1 SERPINE1
Type:
Enzyme
Mol. Mass.:
45064.00
Organism:
Homo sapiens (Human)
Description:
P05121
Residue:
402
  
Inhibitor
Name:
BDBM50242805
Synonyms:
2-((3,5-bis(trifluoromethyl)benzyl)(4-(N-(4-(trifluoromethoxy)benzyl)-4-(trifluoromethoxy)phenylsulfonamido)phenyl)amino)-2-oxoacetic acid | CHEMBL354960
Type:
Small organic molecule
Emp. Form.:
C32H20F12N2O7S
Mol. Mass.:
804.556
SMILES:
OC(=O)C(=O)N(Cc1cc(cc(c1)C(F)(F)F)C(F)(F)F)c1ccc(cc1)N(Cc1ccc(OC(F)(F)F)cc1)S(=O)(=O)c1ccc(OC(F)(F)F)cc1
: