Target
Cytochrome P450 2C9
Ligand
BDBM50241496
Substrate
Meas. Tech.
ChEMBL_497351 (CHEMBL999390)
IC50
2800±n/a nM
Citation
 Appiah-Opong, Rde Esch, ICommandeur, JNAndarini, MVermeulen, NP Structure-activity relationships for the inhibition of recombinant human cytochromes P450 by curcumin analogues. Eur J Med Chem 43:1621-31 (2008)  
Target
Name:
Cytochrome P450 2C9
Synonyms:
(R)-limonene 6-monooxygenase CP2C9_HUMAN CYP2C9 Cytochrome P450 2C9 (CYP2C9 ) P-450MP P450 PB-1 | S-mephenytoin 4-hydroxylase
Type:
Enzyme
Mol. Mass.:
55636.33
Organism:
Homo sapiens (Human)
Description:
P11712
Residue:
490
  
Inhibitor
Name:
BDBM50241496
Synonyms:
2,5-bis(4-hydroxy-3-methoxybenzylidene)cyclopentanone | CHEMBL270361
Type:
Small organic molecule
Emp. Form.:
C21H20O5
Mol. Mass.:
352.3805
SMILES:
COc1cc(\C=C2/CC\C(=C/c3ccc(O)c(OC)c3)C2=O)ccc1O
: