Target
Cytochrome P450 1A2
Ligand
BDBM50264834
Substrate
Meas. Tech.
ChEMBL_497349 (CHEMBL999388)
IC50
21000±n/a nM
Citation
 Appiah-Opong, Rde Esch, ICommandeur, JNAndarini, MVermeulen, NP Structure-activity relationships for the inhibition of recombinant human cytochromes P450 by curcumin analogues. Eur J Med Chem 43:1621-31 (2008)  
Target
Name:
Cytochrome P450 1A2
Synonyms:
CP1A2_HUMAN CYPIA2 Cytochrome P(3)450 Cytochrome P450 1A2 (CYP1A2) Cytochrome P450-P3
Type:
Enzyme
Mol. Mass.:
58423.38
Organism:
Homo sapiens (Human)
Description:
P05177
Residue:
516
  
Inhibitor
Name:
BDBM50264834
Synonyms:
2,6-bis(4-methylbenzylidene)cyclohexanone | CHEMBL502160
Type:
Small organic molecule
Emp. Form.:
C22H22O
Mol. Mass.:
302.4095
SMILES:
Cc1ccc(\C=C2/CCC\C(=C/c3ccc(C)cc3)C2=O)cc1
: