Target
Cytochrome P450 2D6
Ligand
BDBM50067044
Substrate
Meas. Tech.
ChEMBL_497352 (CHEMBL999391)
IC50
2000±n/a nM
Citation
 Appiah-Opong, Rde Esch, ICommandeur, JNAndarini, MVermeulen, NP Structure-activity relationships for the inhibition of recombinant human cytochromes P450 by curcumin analogues. Eur J Med Chem 43:1621-31 (2008)  
Target
Name:
Cytochrome P450 2D6
Synonyms:
CP2D6_HUMAN CYP2DL1 Cytochrome P450 2D6 (CYP2D6) P450-DB1
Type:
Protein
Mol. Mass.:
55774.82
Organism:
Homo sapiens (Human)
Description:
P10635
Residue:
497
  
Inhibitor
Name:
BDBM50067044
Synonyms:
(1E,4E)-1,5-Bis-(4-hydroxy-phenyl)-penta-1,4-dien-3-one 1,5-Bis(4-hydroxyphenyl)penta-1,4-dien-3-one CHEMBL129134
Type:
Small organic molecule
Emp. Form.:
C17H14O3
Mol. Mass.:
266.2913
SMILES:
Oc1ccc(\C=C\C(=O)\C=C\c2ccc(O)cc2)cc1
: