Target
Melanocortin receptor 4
Ligand
BDBM50261227
Substrate
Meas. Tech.
ChEMBL_533293 (CHEMBL973312)
Ki
3.4±n/a nM
Citation
 Chen, CTucci, FCJiang, WTran, JAFleck, BAHoare, SRWen, JChen, TJohns, MMarkison, SFoster, ACMarinkovic, DChen, CWArellano, MHarman, JSaunders, JBozigian, HMarks, D Pharmacological and pharmacokinetic characterization of 2-piperazine-alpha-isopropyl benzylamine derivatives as melanocortin-4 receptor antagonists. Bioorg Med Chem 16:5606-18 (2008)  
Target
Name:
Melanocortin receptor 4
Synonyms:
MC4-R MC4R_HUMAN Melanocortin receptor 4 (MC-4) Melanocortin receptor 4 (MC4R)
Type:
Enzyme
Mol. Mass.:
36949.50
Organism:
Homo sapiens (Human)
Description:
P32245
Residue:
332
  
Inhibitor
Name:
BDBM50261227
Synonyms:
1-{2-[(1S)-(Methylaminoacetamido)-2-methylpropyl]-6-fluorophenyl}-4-[(2R)-methyl-3-(2-methoxy-4-chlorophenyl)propionyl]piperazine | CHEMBL467772
Type:
Small organic molecule
Emp. Form.:
C28H38ClFN4O3
Mol. Mass.:
533.078
SMILES:
CNCC(=O)N[C@@H](C(C)C)c1cccc(F)c1N1CCN(CC1)C(=O)[C@H](C)Cc1ccc(Cl)cc1OC
: