Target
Sigma non-opioid intracellular receptor 1
Ligand
BDBM50248905
Substrate
Meas. Tech.
ChEMBL_541388 (CHEMBL1023943)
Ki
3.6±n/a nM
Citation
 Zampieri, DGrazia Mamolo, MLaurini, EZanette, CFlorio, CCollina, SRossi, DAzzolina, OVio, L Substituted benzo[d]oxazol-2(3H)-one derivatives with preference for the sigma1 binding site. Eur J Med Chem 44:124-30 (2008)  
Target
Name:
Sigma non-opioid intracellular receptor 1
Synonyms:
Opioid receptor SGMR1_RAT Sigma non-opioid intracellular receptor 1 Sigma-1 | Sigmar1
Type:
Enzyme Catalytic Domain
Mol. Mass.:
25266.54
Organism:
RAT
Description:
Q9R0C9
Residue:
223
  
Inhibitor
Name:
BDBM50248905
Synonyms:
3-((1-benzylpiperidin-4-yl)methyl)benzo[d]oxazol-2(3H)-one CHEMBL472979
Type:
Small organic molecule
Emp. Form.:
C20H22N2O2
Mol. Mass.:
322.4009
SMILES:
O=c1oc2ccccc2n1CC1CCN(Cc2ccccc2)CC1
: