Target
Sigma non-opioid intracellular receptor 1
Ligand
BDBM50248930
Substrate
Meas. Tech.
ChEMBL_541388 (CHEMBL1023943)
Ki
33±n/a nM
Citation
 Zampieri, DGrazia Mamolo, MLaurini, EZanette, CFlorio, CCollina, SRossi, DAzzolina, OVio, L Substituted benzo[d]oxazol-2(3H)-one derivatives with preference for the sigma1 binding site. Eur J Med Chem 44:124-30 (2008)  
Target
Name:
Sigma non-opioid intracellular receptor 1
Synonyms:
Opioid receptor SGMR1_RAT Sigma non-opioid intracellular receptor 1 Sigma-1 | Sigmar1
Type:
Enzyme Catalytic Domain
Mol. Mass.:
25266.54
Organism:
RAT
Description:
Q9R0C9
Residue:
223
  
Inhibitor
Name:
BDBM50248930
Synonyms:
3-((1-(2-methylbenzyl)piperidin-4-yl)methyl)benzo[d]oxazol-2(3H)-one CHEMBL474175
Type:
Small organic molecule
Emp. Form.:
C21H24N2O2
Mol. Mass.:
336.4275
SMILES:
Cc1ccccc1CN1CCC(Cn2c3ccccc3oc2=O)CC1
: