Target
Sigma non-opioid intracellular receptor 1
Ligand
BDBM81982
Substrate
Meas. Tech.
ChEMBL_541388 (CHEMBL1023943)
Ki
180±n/a nM
Citation
 Zampieri, DGrazia Mamolo, MLaurini, EZanette, CFlorio, CCollina, SRossi, DAzzolina, OVio, L Substituted benzo[d]oxazol-2(3H)-one derivatives with preference for the sigma1 binding site. Eur J Med Chem 44:124-30 (2008)  
Target
Name:
Sigma non-opioid intracellular receptor 1
Synonyms:
Opioid receptor SGMR1_RAT Sigma non-opioid intracellular receptor 1 Sigma-1 | Sigmar1
Type:
Enzyme Catalytic Domain
Mol. Mass.:
25266.54
Organism:
RAT
Description:
Q9R0C9
Residue:
223
  
Inhibitor
Name:
BDBM81982
Synonyms:
CAS_97-39-2 DTG Tol2Gdn | cid_7333
Type:
Small organic molecule
Emp. Form.:
C15H17N3
Mol. Mass.:
239.3156
SMILES:
Cc1ccccc1NC(N)=Nc1ccccc1C
: