Target
Proteinase-activated receptor 1
Ligand
BDBM50261061
Substrate
Meas. Tech.
ChEMBL_556010 (CHEMBL964660)
Ki
4.4±n/a nM
Citation
 Chackalamannil, SWang, YGreenlee, WJHu, ZXia, YAhn, HSBoykow, GHsieh, YPalamanda, JAgans-Fantuzzi, JKurowski, SGraziano, MChintala, M Discovery of a novel, orally active himbacine-based thrombin receptor antagonist (SCH 530348) with potent antiplatelet activity. J Med Chem 51:3061-4 (2008)  
Target
Name:
Proteinase-activated receptor 1
Synonyms:
CF2R F2R PAR1 Proteinase activated receptor 1 TR Thrombin receptor/ Proteinase-activated receptor 1(Par-1)
Type:
Protein
Mol. Mass.:
47450.07
Organism:
Homo sapiens (Human)
Description:
P25116
Residue:
425
  
Inhibitor
Name:
BDBM50261061
Synonyms:
CHEMBL493633 | N-[(1R,3aR,4aR,6R,8aR,9S,9aS)-9-[(E)-2-[5-(3-fluorophenyl)-2-pyridinyl]ethenyl]-dodecahydro-1-methyl-3-oxonaphtho[2,3-c]furan-6-yl]-N-methylurea
Type:
Small organic molecule
Emp. Form.:
C28H32FN3O3
Mol. Mass.:
477.5704
SMILES:
CNC(=O)N[C@@H]1CC[C@@H]2[C@H](C[C@@H]3[C@@H]([C@@H](C)OC3=O)[C@H]2C=Cc2ccc(cn2)-c2cccc(F)c2)C1
: