Target
Prostaglandin G/H synthase 1
Ligand
BDBM50247230
Substrate
Meas. Tech.
ChEMBL_518948 (CHEMBL941536)
IC50
970±n/a nM
Citation
 Kang, SSCuendet, MEndringer, DCCroy, VLPezzuto, JMLipton, MA Synthesis and biological evaluation of a library of resveratrol analogues as inhibitors of COX-1, COX-2 and NF-kappaB. Bioorg Med Chem 17:1044-54 (2009)  
Target
Name:
Prostaglandin G/H synthase 1
Synonyms:
COX-1 Cyclooxygenase Cyclooxygenase-1 (COX-1) PTGS1 | Prostaglandin G/H synthase (cyclooxygenase)
Type:
Enzyme
Mol. Mass.:
68692.62
Organism:
Homo sapiens (Human)
Description:
P23219
Residue:
599
  
Inhibitor
Name:
BDBM50247230
Synonyms:
5-(2-(4-(trifluoromethyl)phenyl)prop-1-enyl)benzene-1,3-diol | CHEMBL474128
Type:
Small organic molecule
Emp. Form.:
C16H13F3O2
Mol. Mass.:
294.2684
SMILES:
C\C(=C/c1cc(O)cc(O)c1)c1ccc(cc1)C(F)(F)F
: