Target
Urotensin-2 receptor
Ligand
BDBM50244021
Substrate
Meas. Tech.
ChEMBL_555221 (CHEMBL965358)
Ki
4±n/a nM
Citation
 McAtee, JJDodson, JWDowdell, SEErhard, KGirard, GRGoodman, KBHilfiker, MAJin, JSehon, CASha, DShi, DWang, FWang, GZWang, NWang, YViet, AQYuan, CCZhang, DAiyar, NVBehm, DJCarballo, LHEvans, CAFries, HENagilla, RRoethke, TJXu, XDouglas, SANeeb, MJ Potent and selective small-molecule human urotensin-II antagonists with improved pharmacokinetic profiles. Bioorg Med Chem Lett 18:3716-9 (2008)  
Target
Name:
Urotensin-2 receptor
Synonyms:
G-protein coupled receptor 14 UR-II-R UTS2R Urotensin-II
Type:
Enzyme Catalytic Domain
Mol. Mass.:
42159.71
Organism:
Homo sapiens (Human)
Description:
Urotensin-II UTS2R HUMAN::Q9UKP6
Residue:
389
  
Inhibitor
Name:
BDBM50244021
Synonyms:
4'-(1-{[2-(6,7-Dichloro-2-oxo-2H-quinoxalin-1-yl)-acetyl]-methyl-amino}-2-morpholin-4-yl-ethyl)-biphenyl-3-carboxylic acid methylamide | CHEMBL507691
Type:
Small organic molecule
Emp. Form.:
C31H31Cl2N5O4
Mol. Mass.:
608.515
SMILES:
CNC(=O)c1cccc(c1)-c1ccc(cc1)C(CN1CCOCC1)N(C)C(=O)Cn1c2cc(Cl)c(Cl)cc2ncc1=O
: