Target
ATP-dependent translocase ABCB1
Ligand
BDBM20607
Substrate
Meas. Tech.
ChEMBL_555234 (CHEMBL961375)
EC50
56500±n/a nM
Citation
 Colabufo, NABerardi, FContino, MInglese, CNiso, MPerrone, R Effect of some P-glycoprotein modulators on Rhodamine-123 absorption in guinea-pig ileum. Bioorg Med Chem Lett 18:3741-4 (2008)  
Target
Name:
ATP-dependent translocase ABCB1
Synonyms:
ABCB1 MDR1_HUMAN Multidrug resistance protein 1 P-glycoprotein (P-gp) PGY1
Type:
Protein
Mol. Mass.:
141503.50
Organism:
Homo sapiens (Human)
Description:
P08183
Residue:
1280
  
Inhibitor
Name:
BDBM20607
Synonyms:
(2-{4-[(1Z)-1,2-diphenylbut-1-en-1-yl]phenoxy}ethyl)dimethylamine CHEMBL83 NCGC00024928 Tamoxifen Tamoxifen, 7 med.21724, Compound Tamoxifen
Type:
Small organic molecule
Emp. Form.:
C26H29NO
Mol. Mass.:
371.5146
SMILES:
CC\C(=C(/c1ccccc1)c1ccc(OCCN(C)C)cc1)c1ccccc1
: