Target
Gamma-aminobutyric acid receptor subunit rho-1
Ligand
BDBM24183
Substrate
Meas. Tech.
ChEMBL_554599 (CHEMBL964513)
EC50
800±n/a nM
Citation
 Kumar, RJChebib, MHibbs, DEKim, HLJohnston, GASalam, NKHanrahan, JR Novel gamma-aminobutyric acid rho1 receptor antagonists; synthesis, pharmacological activity and structure-activity relationships. J Med Chem 51:3825-40 (2008)  
Target
Name:
Gamma-aminobutyric acid receptor subunit rho-1
Synonyms:
GABA receptor rho-1 subunit GABRR1 | GBRR1_HUMAN
Type:
PROTEIN
Mol. Mass.:
55892.34
Organism:
Homo sapiens (Human)
Description:
ChEMBL_1456653
Residue:
479
  
Inhibitor
Name:
BDBM24183
Synonyms:
4-amino-n-[2,3-3H]butyric acid Aminalon GABA [3H]GABA | cid_119
Type:
Radiolabeled ligand
Emp. Form.:
C4H9NO2
Mol. Mass.:
103.1198
SMILES:
NCCCC(O)=O
: