Target
Gamma-aminobutyric acid type B receptor subunit 1
Ligand
BDBM24183
Substrate
Meas. Tech.
ChEMBL_554602 (CHEMBL964516)
EC50
1700±n/a nM
Citation
 Kumar, RJChebib, MHibbs, DEKim, HLJohnston, GASalam, NKHanrahan, JR Novel gamma-aminobutyric acid rho1 receptor antagonists; synthesis, pharmacological activity and structure-activity relationships. J Med Chem 51:3825-40 (2008)  
Target
Name:
Gamma-aminobutyric acid type B receptor subunit 1
Synonyms:
GABA-B receptor GABA-B-R1 GABBR1 GARABR1 Gb1
Type:
Enzyme Catalytic Domain
Mol. Mass.:
108337.22
Organism:
Homo sapiens (Human)
Description:
Q9UBS5
Residue:
961
  
Inhibitor
Name:
BDBM24183
Synonyms:
4-amino-n-[2,3-3H]butyric acid Aminalon GABA [3H]GABA | cid_119
Type:
Radiolabeled ligand
Emp. Form.:
C4H9NO2
Mol. Mass.:
103.1198
SMILES:
NCCCC(O)=O
: