Target
Nociceptin receptor
Ligand
BDBM50243887
Substrate
Meas. Tech.
ChEMBL_491434 (CHEMBL948529)
Ki
11±n/a nM
Citation
 Yoshizumi, TTakahashi, HMiyazoe, HSugimoto, YTsujita, TKato, TIto, HKawamoto, HHirayama, MIchikawa, DAzuma-Kanoh, TOzaki, SShibata, YTani, TChiba, MIshii, YOkuda, STadano, KFukuroda, TOkamoto, OOhta, H A novel class of cycloalkano[b]pyridines as potent and orally active opioid receptor-like 1 antagonists with minimal binding affinity to the hERG K+ channel. J Med Chem 51:4021-9 (2008)  
Target
Name:
Nociceptin receptor
Synonyms:
KOR-3 Mu-type opioid receptor (Mu) Nociceptin Receptor (ORL1 Receptor) Nociceptin receptor (ORL-1) Nociceptin/Orphanin FQ, NOP receptor OPIATE ORL-1 OPRL1 protein ORL1 Opioid receptor like-1 Orphanin FQ receptor (ORL1) | P41146
Type:
G Protein-Coupled Receptor (GPCR)
Mol. Mass.:
40702.87
Organism:
Homo sapiens (Human)
Description:
P41146
Residue:
370
  
Inhibitor
Name:
BDBM50243887
Synonyms:
(-)-(3R,4R)-4-(2-Chloro-4-fluorophenyl)-3-hydroxy-1-{[(6R,8S)-8-hydroxy-5,6,7,8-tetrahydroquinolin-6-yl]methyl}piperidinium Chloride CHEMBL487458
Type:
Small organic molecule
Emp. Form.:
C21H24ClFN2O2
Mol. Mass.:
390.879
SMILES:
O[C@H]1CN(C[C@H]2C[C@H](O)c3ncccc3C2)CC[C@@H]1c1ccc(F)cc1Cl
: