Target
Kappa-type opioid receptor
Ligand
BDBM50243887
Substrate
Meas. Tech.
ChEMBL_491467 (CHEMBL949523)
IC50
>10000±n/a nM
Citation
 Yoshizumi, TTakahashi, HMiyazoe, HSugimoto, YTsujita, TKato, TIto, HKawamoto, HHirayama, MIchikawa, DAzuma-Kanoh, TOzaki, SShibata, YTani, TChiba, MIshii, YOkuda, STadano, KFukuroda, TOkamoto, OOhta, H A novel class of cycloalkano[b]pyridines as potent and orally active opioid receptor-like 1 antagonists with minimal binding affinity to the hERG K+ channel. J Med Chem 51:4021-9 (2008)  
Target
Name:
Kappa-type opioid receptor
Synonyms:
K-OR-1 Kappa-opioid receptor (KOR) Kappa-type opioid receptor (KOR) OPIATE Kappa OPRK1 kappa opioid receptor (KOR)
Type:
G Protein-Coupled Receptor (GPCR)
Mol. Mass.:
42648.76
Organism:
Homo sapiens (Human)
Description:
P41145
Residue:
380
  
Inhibitor
Name:
BDBM50243887
Synonyms:
(-)-(3R,4R)-4-(2-Chloro-4-fluorophenyl)-3-hydroxy-1-{[(6R,8S)-8-hydroxy-5,6,7,8-tetrahydroquinolin-6-yl]methyl}piperidinium Chloride CHEMBL487458
Type:
Small organic molecule
Emp. Form.:
C21H24ClFN2O2
Mol. Mass.:
390.879
SMILES:
O[C@H]1CN(C[C@H]2C[C@H](O)c3ncccc3C2)CC[C@@H]1c1ccc(F)cc1Cl
: