Target
Galectin-3
Ligand
BDBM50243888
Substrate
Meas. Tech.
ChEMBL_491863 (CHEMBL946200)
Kd
4400000±n/a nM
Citation
 Oberg, CTBlanchard, HLeffler, HNilsson, UJ Protein subtype-targeting through ligand epimerization: talose-selectivity of galectin-4 and galectin-8. Bioorg Med Chem Lett 18:3691-4 (2008)  
Target
Name:
Galectin-3
Synonyms:
LEG3_HUMAN MAC2
Type:
Enzyme
Mol. Mass.:
26156.54
Organism:
Homo sapiens (Human)
Description:
P17931
Residue:
250
  
Inhibitor
Name:
BDBM50243888
Synonyms:
CHEMBL442951 methyl beta-D-galactoside
Type:
Small organic molecule
Emp. Form.:
C7H14O6
Mol. Mass.:
194.1825
SMILES:
CO[C@@H]1O[C@H](CO)[C@H](O)[C@H](O)[C@H]1O
: