Target
C-C chemokine receptor type 4
Ligand
BDBM50243996
Substrate
Meas. Tech.
ChEMBL_491885 (CHEMBL946415)
IC50
220±n/a nM
Citation
 Yokoyama, KIshikawa, NIgarashi, SKawano, NHattori, KMiyazaki, TOgino, SMatsumoto, YTakeuchi, MOhta, M Discovery of potent CCR4 antagonists: Synthesis and structure-activity relationship study of 2,4-diaminoquinazolines. Bioorg Med Chem 16:7021-32 (2008)  
Target
Name:
C-C chemokine receptor type 4
Synonyms:
C-C CKR-4 C-C chemokine receptor type 4 (CCR4) CCR-4 CCR4_HUMAN CMKBR4 | K5-5
Type:
Enzyme
Mol. Mass.:
41406.41
Organism:
Homo sapiens (Human)
Description:
P51679
Residue:
360
  
Inhibitor
Name:
BDBM50243996
Synonyms:
CHEMBL510375 | N-Cycloheptyl-2-(4-isopropylpiperazine-1-yl)-6,7-dimethoxyquinazolin-4-amine
Type:
Small organic molecule
Emp. Form.:
C24H37N5O2
Mol. Mass.:
427.5829
SMILES:
COc1cc2nc(nc(NC3CCCCCC3)c2cc1OC)N1CCN(CC1)C(C)C
: